Post
Topic
Board Announcements (Altcoins)
Re: [GMT] Gallion Secure, Private, Intractable
by
securitypc
on 03/03/2018, 03:28:38 UTC
../src/libWallet.a(WalletLegacy.cpp.o): En la función `CryptoNote::WalletLegacy:                                                                                                                                                             :getSeed(std::__cxx11::basic_string, std::allocator                                                                                                                                                              >&)':
/home/pool/gallion/src/WalletLegacy/WalletLegacy.cpp:424: referencia a `Crypto::                                                                                                                                                             ElectrumWords::bytes_to_words(Crypto::SecretKey const&, std::__cxx11::basic_stri                                                                                                                                                             ng, std::allocator >&, std::__cxx11::basic_st                                                                                                                                                             ring, std::allocator > const&)' sin definir
collect2: error: ld returned 1 exit status
tests/CMakeFiles/IntegrationTests.dir/build.make:225: fallo en las instrucciones                                                                                                                                                              para el objetivo 'tests/integration_tests'
make[2]: *** [tests/integration_tests] Error 1
CMakeFiles/Makefile2:1459: fallo en las instrucciones para el objetivo 'tests/CM                                                                                                                                                             akeFiles/IntegrationTests.dir/all'
make[1]: *** [tests/CMakeFiles/IntegrationTests.dir/all] Error 2
Makefile:94: fallo en las instrucciones para el objetivo 'all'
make: *** [all] Error 2
 Undecided Undecided Undecided Undecided Undecided Undecided Undecided